{"text_format":"1","workbook":"xlsx","n_sheets":10,"sheets":["ECUACIONES","HOJA DE DATOS","DATOS RECRIA OVINO","DATOS RECRIA CAPRINO","FICHA RECRIA OVINO","FICHA RECRIA CAPRINO","SIMULACION OVINO","SIMULACION CAPRINO","PIENSOS","MODULO"],"not_rendered":{"charts":0,"images":27,"macros":1,"external_links":0,"defined_names":6,"comments":5,"pivot_tables":0},"unopened":[],"bounds":{"document_bytes":16777216,"sheet_cells":100000,"rows_first":2000,"rows_last":500,"rows_between":2000,"halvings":0,"cell_chars":16384,"cell_head_chars":4096},"cells_cut":0,"cells_raw":0,"read":"whole","date_system":"1900"}

{"sheet":"ECUACIONES","index":0,"n_rows":86,"n_cols":10,"rows_kept":86,"cut":false,"hidden":false,"merged":[]}
["SIMULACION CORDERAS"]
["GMD"]
[null,"kg PV","A","B","Y=AX+B","GMD = A*UFL + B"]
[null,20,1418.9,-887.84]
[null,25,1418.9,-1010.8]
[null,30,1000,-760]
[null,35,1071.4000000000001,-935.71]
[null,40,500,-405]
[]
[]
["UFL","kg PV","A","B","Y=AX+B","UFL = A*GMD + B"]
[null,20,6.9999999999999999E-4,0.62670000000000003]
[null,25,6.9999999999999999E-4,0.71330000000000005]
[null,30,1E-3,0.76]
[null,35,8.9999999999999998E-4,0.88]
{"$rows_left_out":72}
{"sheet":"HOJA DE DATOS","index":1,"n_rows":343,"n_cols":12,"rows_kept":343,"cut":false,"hidden":false,"merged":[]}
["SIMULACION CORDERAS",{"$f":"IF('SIMULACION OVINO'!C19=\"\",0,'SIMULACION OVINO'!C19)","v":0.995},{"$f":"IF('SIMULACION OVINO'!D19=\"\",0,'SIMULACION OVINO'!D19)","v":0.85},{"$f":"B1*C1","v":0.84575}]
["PERIODO CRIA",{"$f":"IF('SIMULACION OVINO'!C20=\"\",0,'SIMULACION OVINO'!C20)","v":0.38},{"$f":"IF('SIMULACION OVINO'!D20=\"\",0,'SIMULACION OVINO'!D20)","v":0.08},{"$f":"B2*C2","v":3.04E-2}]
[null,{"$f":"IF('SIMULACION OVINO'!C21=\"\",0,'SIMULACION OVINO'!C21)","v":0},{"$f":"IF('SIMULACION OVINO'!D21=\"\",0,'SIMULACION OVINO'!D21)","v":0},0]
[null,{"$f":"IF('SIMULACION OVINO'!C22=\"\",0,'SIMULACION OVINO'!C22)","v":0},{"$f":"IF('SIMULACION OVINO'!D22=\"\",0,'SIMULACION OVINO'!D22)","v":0},0]
[null,null,"UFL",{"$f":"SUM(D1:D4)","v":0.87614999999999998}]
[null,null,"PV",{"$f":"IF('SIMULACION OVINO'!C11=\"\",\"\",('SIMULACION OVINO'!C11+'SIMULACION OVINO'!C12)/2)","v":20}]
[null,null,"PERIODO",{"$f":"IF('SIMULACION OVINO'!C9=\"\",\"\",'SIMULACION OVINO'!C9)","v":"GROW UP"},"CMD","UFL NEEDS","GMD REC","UFL CREC","UFL MANT","UFL/GR GMD","GMD RECRIA"]
["GMD. EST",{"$f":"IF(D6=\"\",\"\",VLOOKUP(D6,ECUACIONES!B20:D30,2,TRUE))","v":668.57},{"$f":"IF(D6=\"\",\"\",VLOOKUP(D6,ECUACIONES!B20:D30,3,TRUE))","v":-370.87},{"$f":"IF(B8=\"\",\"\",(B8*D5)+C8)","v":214.89760550000005},{"$f":"IF(D6=\"\",\"\",VLOOKUP(D6,ECUACIONES!B20:E30,4,TRUE))","v":998},{"$f":"IF(D6=\"\",\"\",VLOOKUP(D6,ECUACIONES!B20:F30,5,TRUE))","v":0.97},{"$f":"IF(D6=\"\",\"\",VLOOKUP(D6,ECUACIONES!B20:G30,6,TRUE))","v":308},{"$f":"IF(J8=\"\",\"\",D5-I8)","v":0.87614999999999998},{"$f":"IF(D6=\"\",\"\",VLOOKUP($D$6,ECUACIONES!$B$20:$J$30,8,TRUE))","v":0},{"$f":"IF(D6=\"\",\"\",VLOOKUP($D$6,ECUACIONES!$B$20:$J$30,7,TRUE))","v":5.5999999999999999E-3},{"$f":"IF(H8=\"\",\"\",H8/J8)","v":156.45535714285714}]
["kg ganados",{"$f":"IF('SIMULACION OVINO'!C11=\"\",\"\",'SIMULACION OVINO'!C12-'SIMULACION OVINO'!C11)","v":16},null,null,"COBERTURA - NEEDS",{"$f":"IF(D5=0,\"\",D5-F8)","v":-9.3849999999999989E-2},{"$f":"IF(D7=\"\",\"\",IF(D7=\"CRIA\",D8-G8,K8-G8))","v":-151.54464285714286}]
["dias",{"$f":"IF(B9=\"\",\"\",IF(D7=\"CRIA\",(B9/(D8/1000)),(B9*1000)/K8))","v":102.26559379101752}]
[]
[]
["UFL","PV","GMD"]
[null,{"$f":"IF('SIMULACION OVINO'!H12=\"\",\"\",('SIMULACION OVINO'!H12+'SIMULACION OVINO'!H11)/2)","v":""},{"$f":"IF('SIMULACION OVINO'!H20=\"\",\"\",'SIMULACION OVINO'!H20)","v":""}]
["UFL",{"$f":"IF(B14=\"\",\"\",VLOOKUP(B14,ECUACIONES!B12:D16,2,TRUE))","v":""},{"$f":"IF(B14=\"\",\"\",VLOOKUP(B14,ECUACIONES!B12:D16,3,TRUE))","v":""},{"$f":"IF(B15=\"\",\"\",(B15*C14)+C15)","v":""}]
{"$rows_left_out":329}
{"sheet":"DATOS RECRIA OVINO","index":2,"n_rows":42,"n_cols":22,"rows_kept":42,"cut":false,"hidden":false,"merged":[[23,1,24,1],[25,1,26,1],[22,0,26,0],[29,0,36,0],[29,1,30,1],[31,1,32,1],[33,1,34,1],[35,1,36,1],[9,0,12,0],[9,6,18,6],[9,7,10,7],[11,7,12,7],[13,7,15,7],[16,7,18,7],[15,0,19,0],[9,13,15,13],[16,13,23,13],[24,13,32,13],[33,13,40,13],[26,8,28,8],[26,9,28,10],[29,8,31,8],[29,9,31,10],[21,9,21,10],[22,8,23,8],[22,9,23,10],[24,8,25,8],[24,9,25,10],[26,16,26,17],[32,9,32,10],[33,9,33,10],[22,6,33,6],[22,7,23,7],[24,7,25,7],[26,7,28,7],[29,7,31,7],[34,16,34,17],[41,16,41,17],[13,20,13,21],[18,20,18,21],[7,13,7,18],[7,19,7,21],[24,20,24,21],[29,20,29,21],[30,20,30,21],[31,20,31,21],[32,20,32,21],[33,20,33,21],[34,20,34,21],[10,16,10,17],[11,16,11,17],[18,16,18,17]]}
[]
[]
[]
[]
[]
[]
["ENTER SHEEP DATA",null,null,null,null,null,"ECHONOMICAL BALANCE",null,null,null,null,null,null,"SCHEDULE/PLANNING"]
[null,null,null,null,null,null,null,null,null,null,null,null,null,"SCHEDULE PER PERIOD",null,null,null,null,null,"SUMMARY "]
[null,null,null,null,null,null,null,"PERIOD","FEED","Kg/DAY","KG/ANIMAL","KG/GROUP",null,null,null,"KG.BW",null,null,"DATE"]
["FARM DATA","FARM","EXAMPLE",null,null,null,"FEEDIN PLANNING","MR PERIOD",{"$f":"IF(C16=\"\",\"\",C16)","v":"NANTAMILK SUPREME"},null,{"$f":"IF(I10=\"\",\"\",'HOJA DE DATOS'!B100)","v":8.8000000000000007},{"$f":"IF(K10=\"\",\"\",$C$13*K10)","v":2032.8000000000002},null,"MR PERIOD",null,{"$f":"IF(D30=\"\",\"\",D30)","v":4},null,null,{"$f":"IF(C12=\"\",\"\",C12)","v":"2016-10-12"},null,{"$f":"IF(S10=\"\",\"\",S10)","v":"2016-10-12"}]
[null,"BREED","LACAUNE",null,null,null,null,null,{"$f":"IF(C17=\"\",\"\",C17)","v":"LACTACOR COPOS"},null,{"$f":"IF(I11=\"\",\"\",'HOJA DE DATOS'!B98)","v":1.5},346.5,null,null,null,null,{"$f":"IF(C16=\"\",\"\",C16)","v":"NANTAMILK SUPREME"}]
[null,"INITIAL DATE","2016-10-12",null,null,null,null,"GROW UP PERIOD",{"$f":"IF(C18=\"\",\"\",C18)","v":"NANTACOR "},{"$f":"IF(I12=\"\",\"\",'HOJA DE DATOS'!B113/1000)","v":1.095},{"$f":"IF(I12=\"\",\"\",'HOJA DE DATOS'!B122)","v":63.223384195423229},14604.601749142766,null,null,null,null,{"$f":"IF(C17=\"\",\"\",C17)","v":"LACTACOR COPOS"}]
[null,"ANIMALS IN GROUP",231,null,null,null,null,null,{"$f":"IF(C23=\"\",\"\",C23)","v":"STRAW"},{"$f":"IF(I13=\"\",\"\",'HOJA DE DATOS'!B114/1000)","v":0.1},{"$f":"IF(I13=\"\",\"\",'HOJA DE DATOS'!B123)","v":5.7738250406779201},1333.7535843965995,null,null,null,null,"ADG (gr/day)",{"$f":"IF(D31=\"\",\"\",'HOJA DE DATOS'!B101)","v":280.5}]
[null,null,null,null,null,null,null,"REPLACEMENT PERIOD 1",{"$f":"IF(C19=\"\",\"\",C19)","v":"OVIRECRIA"},{"$f":"IF(I14=\"\",\"\",'HOJA DE DATOS'!B141)","v":0.6},{"$f":"IF(I14=\"\",\"\",'HOJA DE DATOS'!B161)","v":78.75},18191.25,null,null,null,null,"DAYS",{"$f":"IF(D31=\"\",\"\",'HOJA DE DATOS'!B102)","v":28.520499108734398},null,null,"REARING PERIOD"]
[null,null,"PRODUCT","PRICE (E/Tm)",null,null,null,null,{"$f":"IF(C24=\"\",\"\",C24)","v":"FORAGE2 (0.65 UFL)"},{"$f":"IF(I15=\"\",\"\",IF('HOJA DE DATOS'!B146=0,'HOJA DE DATOS'!B142,'HOJA DE DATOS'!B146))","v":0.79923076923076897},{"$f":"IF(I15=\"\",\"\",IF('HOJA DE DATOS'!B159=0,'HOJA DE DATOS'!B160,'HOJA DE DATOS'!B159))","v":104.89903846153842},24231.677884615376,null,null,null,null,"MONTH",{"$f":"IF(R14=\"\",\"\",R14/30)","v":0.95068330362447995},null,null,"TOT DAYS",{"$f":"IF(U41=\"\",\"\",U41-U10)","v":322.50874951551668}]
{"$rows_left_out":28}
{"sheet":"DATOS RECRIA CAPRINO","index":3,"n_rows":42,"n_cols":22,"rows_kept":42,"cut":false,"hidden":false,"merged":[[7,13,7,18],[7,19,7,21],[9,0,12,0],[9,6,18,6],[9,7,10,7],[9,13,15,13],[10,16,10,17],[11,7,12,7],[11,16,11,17],[13,7,15,7],[13,20,13,21],[15,0,19,0],[16,7,18,7],[16,13,23,13],[18,16,18,17],[18,20,18,21],[21,9,21,10],[22,0,26,0],[22,6,33,6],[22,7,23,7],[22,8,23,8],[22,9,23,10],[23,1,24,1],[24,7,25,7],[24,8,25,8],[24,9,25,10],[29,0,36,0],[29,8,31,8],[29,9,31,10],[33,1,34,1],[33,9,33,10],[29,20,29,21],[30,20,30,21],[31,1,32,1],[31,16,31,17],[31,20,31,21],[24,13,32,13],[24,20,24,21],[25,1,26,1],[26,7,28,7],[26,8,28,8],[26,9,28,10],[26,16,26,17],[32,9,32,10],[32,20,32,21],[29,1,30,1],[29,7,31,7],[33,20,33,21],[34,16,34,17],[34,20,34,21],[35,1,36,1],[41,16,41,17],[33,13,40,13]]}
[]
[]
[]
[]
[]
[]
["ENTER GOATS DATA",null,null,null,null,null,"ECHONOMICAL BALANCE",null,null,null,null,null,null,"SCHEDULE/PLANNING"]
[null,null,null,null,null,null,null,null,null,null,null,null,null,"SCHEDULE PER PERIOD",null,null,null,null,null,"SUMMARY "]
[null,null,null,null,null,null,null,"FASE","ALIMENTO","Kg/DIA","KG/ANIMAL","KG/LOTE",null,null,null,"KG.BW",null,null,"DATE"]
["FARM DATA","FARM","AGRI DAMIS",null,null,null,"FEEDIN PLANNING","MR PERIOD",{"$f":"IF(C16=\"\",\"\",C16)","v":"NANTAMILK SUPREME"},null,{"$f":"IF(I10=\"\",\"\",'HOJA DE DATOS'!B235)","v":13.125},{"$f":"IF(K10=\"\",\"\",$C$13*K10)","v":2625},null,"MR PERIOD",null,{"$f":"IF(D30=\"\",\"\",D30)","v":3.5},null,null,{"$f":"IF(C12=\"\",\"\",C12)","v":"2015-11-11"},null,{"$f":"IF(S10=\"\",\"\",S10)","v":"2015-11-11"}]
[null,"BRRED","SAANEN",null,null,null,null,null,{"$f":"IF(C17=\"\",\"\",C17)","v":"LACTACOR COPOS"},null,{"$f":"IF(I11=\"\",\"\",'HOJA DE DATOS'!B233)","v":1.56},312,null,null,null,null,{"$f":"IF(C16=\"\",\"\",C16)","v":"NANTAMILK SUPREME"}]
[null,"INITIAL DATE","2015-11-11",null,null,null,null,"GROW UP PERIOD",{"$f":"IF(C18=\"\",\"\",C18)","v":"NANTACOR "},{"$f":"IF(I12=\"\",\"\",'HOJA DE DATOS'!B248/1000)","v":0.82499999999999996},{"$f":"IF(I12=\"\",\"\",'HOJA DE DATOS'!B258)","v":31.73076923076923},6346.1538461538457,null,null,null,null,{"$f":"IF(C17=\"\",\"\",C17)","v":"LACTACOR COPOS"}]
[null,"ANIMALS IN GROUP",200,null,null,null,null,null,{"$f":"IF(C23=\"\",\"\",C23)","v":"STRAW"},{"$f":"IF(I13=\"\",\"\",'HOJA DE DATOS'!B249/1000)","v":7.4999999999999997E-2},{"$f":"IF(I13=\"\",\"\",'HOJA DE DATOS'!B259)","v":2.8846153846153846},576.92307692307691,null,null,null,null,"ADG (gr/day)",{"$f":"IF(D31=\"\",\"\",'HOJA DE DATOS'!B236)","v":180}]
[null,null,null,null,null,null,null,"REPLACEMENT PERIOD 1",{"$f":"IF(C19=\"\",\"\",C19)","v":"CAPRIRECRIA"},{"$f":"IF(I14=\"\",\"\",'HOJA DE DATOS'!B276)","v":0.5},{"$f":"IF(I14=\"\",\"\",'HOJA DE DATOS'!B296)","v":77.884615384615387},15576.923076923078,null,null,null,null,"DAYS",{"$f":"IF(D31=\"\",\"\",'HOJA DE DATOS'!B237)","v":58.333333333333336},null,null,"REARING PERIOD"]
[null,null,"PRODUCT","PRICE (E/Tm)",null,null,null,null,{"$f":"IF(C24=\"\",\"\",C24)","v":"FORAGE2 (0.65 UFL)"},{"$f":"IF(I15=\"\",\"\",IF('HOJA DE DATOS'!B281=0,'HOJA DE DATOS'!B277,'HOJA DE DATOS'!B281))","v":0.71200000000000008},{"$f":"IF(I15=\"\",\"\",IF('HOJA DE DATOS'!B294=0,'HOJA DE DATOS'!B295,'HOJA DE DATOS'!B294))","v":110.90769230769233},22181.538461538465,null,null,null,null,"MONTH",{"$f":"IF(R14=\"\",\"\",R14/30)","v":1.9444444444444444},null,null,"TOT DAYS",{"$f":"IF(U41=\"\",\"\",U41-U10)","v":357.56410256410891}]
{"$rows_left_out":28}
{"sheet":"FICHA RECRIA OVINO","index":4,"n_rows":18,"n_cols":8,"rows_kept":18,"cut":false,"hidden":false,"merged":[[17,4,19,5],[17,2,19,2],[17,3,19,3],[17,6,19,7]]}
[null,"TECHNICAL-ECHONOMICAL RESULTS RECIPE"]
[]
[]
[null,"FARM",{"$f":"IF('DATOS RECRIA OVINO'!C10=\"\",\"\",'DATOS RECRIA OVINO'!C10)","v":"EXAMPLE"},"BIRTH DATE",{"$f":"IF('DATOS RECRIA OVINO'!S42=\"\",\"\",'DATOS RECRIA OVINO'!S42)","v":"2017-10-14T12:12:35.958"}]
[null,"BREED",{"$f":"IF('DATOS RECRIA OVINO'!C11=\"\",\"\",'DATOS RECRIA OVINO'!C11)","v":"LACAUNE"},"FIRST BIRTH AGE (month)",{"$f":"IF('DATOS RECRIA OVINO'!V21=\"\",\"\",'DATOS RECRIA OVINO'!V21)","v":12.250291650517223}]
[null,"DATE",{"$f":"IF('DATOS RECRIA OVINO'!C12=\"\",\"\",'DATOS RECRIA OVINO'!C12)","v":"2016-10-12"},"GLOBAL REARING COST",{"$f":"IF('DATOS RECRIA OVINO'!I34=\"\",\"\",'DATOS RECRIA OVINO'!I34)","v":105.33167104980268}]
[null,"Nº (GROUP)",{"$f":"IF('DATOS RECRIA OVINO'!C13=\"\",\"\",'DATOS RECRIA OVINO'!C13)","v":231}]
[]
[null,null,null,null,null,"FECUNDATION",null,"END REARING PERIOD"]
[null,"BODY WEIGHT",{"$f":"IF('DATOS RECRIA OVINO'!$P$10=\"\",\"\",'DATOS RECRIA OVINO'!P10)","v":4},{"$f":"IF('DATOS RECRIA OVINO'!P16=\"\",\"\",'DATOS RECRIA OVINO'!P16)","v":12},{"$f":"IF('DATOS RECRIA OVINO'!P24=\"\",\"\",'DATOS RECRIA OVINO'!P24)","v":33},null,{"$f":"IF('DATOS RECRIA OVINO'!P33=\"\",\"\",'DATOS RECRIA OVINO'!P33)","v":45},{"$f":"IF('DATOS RECRIA OVINO'!P41=\"\",\"\",'DATOS RECRIA OVINO'!P41)","v":60}]
[null,"DATE",{"$f":"IF('DATOS RECRIA OVINO'!S10=\"\",\"\",'DATOS RECRIA OVINO'!S10)","v":"2016-10-12"},{"$f":"IF('DATOS RECRIA OVINO'!S16=\"\",\"\",'DATOS RECRIA OVINO'!S16)","v":"2016-11-09T12:29:31.123"},{"$f":"IF('DATOS RECRIA OVINO'!S24=\"\",\"\",'DATOS RECRIA OVINO'!S24)","v":"2017-01-06T06:12:35.958"},{"$f":"IF('DATOS RECRIA OVINO'!S32=\"\",\"\",'DATOS RECRIA OVINO'!S32)","v":"2017-05-17T12:12:35.958"},{"$f":"IF('DATOS RECRIA OVINO'!S33=\"\",\"\",'DATOS RECRIA OVINO'!S33)","v":"2017-04-16T06:12:35.958"},{"$f":"IF('DATOS RECRIA OVINO'!S41=\"\",\"\",'DATOS RECRIA OVINO'!S41)","v":"2017-08-30T12:12:35.958"}]
[null,"PRODUCT",{"$f":"IF('DATOS RECRIA OVINO'!U31=\"\",\"\",'DATOS RECRIA OVINO'!U31)","v":"NANTAMILK SUPREME"},{"$f":"IF('DATOS RECRIA OVINO'!U33=\"\",\"\",'DATOS RECRIA OVINO'!U33)","v":"NANTACOR "},{"$f":"IF('DATOS RECRIA OVINO'!U34=\"\",\"\",'DATOS RECRIA OVINO'!U34)","v":"OVIRECRIA"},null,{"$f":"IF('DATOS RECRIA OVINO'!U35=\"\",\"\",'DATOS RECRIA OVINO'!U35)","v":"OVIRECRIA CONT."},{"$f":"IF('DATOS RECRIA OVINO'!V35=\"\",\"\",'DATOS RECRIA OVINO'!V35)","v":""}]
[null,null,{"$f":"IF('DATOS RECRIA OVINO'!U32=\"\",\"\",'DATOS RECRIA OVINO'!U32)","v":"LACTACOR COPOS"}]
[null,"DAYS",{"$f":"IF('DATOS RECRIA OVINO'!R14=\"\",\"\",'DATOS RECRIA OVINO'!R14)","v":28.520499108734398},{"$f":"IF('DATOS RECRIA OVINO'!R21=\"\",\"\",'DATOS RECRIA OVINO'!R21)","v":57.738250406779201},{"$f":"IF('DATOS RECRIA OVINO'!R29=\"\",\"\",'DATOS RECRIA OVINO'!R29)","v":100},null,{"$f":"IF('DATOS RECRIA OVINO'!R37=\"\",\"\",'DATOS RECRIA OVINO'!R37)","v":136.25},{"$f":"IF('DATOS RECRIA OVINO'!S37=\"\",\"\",'DATOS RECRIA OVINO'!S37)","v":""}]
[null,"MONTH",{"$f":"IF('DATOS RECRIA OVINO'!R15=\"\",\"\",'DATOS RECRIA OVINO'!R15)","v":0.95068330362447995},{"$f":"IF('DATOS RECRIA OVINO'!R22=\"\",\"\",'DATOS RECRIA OVINO'!R22)","v":1.92460834689264},{"$f":"IF('DATOS RECRIA OVINO'!R30=\"\",\"\",'DATOS RECRIA OVINO'!R30)","v":3.3333333333333335},null,{"$f":"IF('DATOS RECRIA OVINO'!R38=\"\",\"\",'DATOS RECRIA OVINO'!R38)","v":4.541666666666667},{"$f":"IF('DATOS RECRIA OVINO'!S38=\"\",\"\",'DATOS RECRIA OVINO'!S38)","v":""}]
{"$rows_left_out":4}
{"sheet":"FICHA RECRIA CAPRINO","index":5,"n_rows":18,"n_cols":8,"rows_kept":18,"cut":false,"hidden":false,"merged":[[17,2,19,2],[17,3,19,3],[17,4,19,5],[17,6,19,7]]}
[null,"TECHNICAL-ECHONOMICAL RESULTS RECIPE"]
[]
[]
[null,"FARM",{"$f":"IF('DATOS RECRIA CAPRINO'!C10=\"\",\"\",'DATOS RECRIA CAPRINO'!C10)","v":"AGRI DAMIS"},"BIRTH DATE",{"$f":"IF('DATOS RECRIA CAPRINO'!S42=\"\",\"\",'DATOS RECRIA CAPRINO'!S42)","v":"2016-12-17T13:32:18.462"}]
[null,"BREED",{"$f":"IF('DATOS RECRIA CAPRINO'!C11=\"\",\"\",'DATOS RECRIA CAPRINO'!C11)","v":"SAANEN"},"FIRST BIRTH AGE (month)",{"$f":"IF('DATOS RECRIA CAPRINO'!V21=\"\",\"\",'DATOS RECRIA CAPRINO'!V21)","v":13.41880341880363}]
[null,"DATE",{"$f":"IF('DATOS RECRIA CAPRINO'!C12=\"\",\"\",'DATOS RECRIA CAPRINO'!C12)","v":"2015-11-11"},"GLOBAL REARING COST",{"$f":"IF('DATOS RECRIA CAPRINO'!I34=\"\",\"\",'DATOS RECRIA CAPRINO'!I34)","v":98.563970414201421}]
[null,"Nº (GROUP)",{"$f":"IF('DATOS RECRIA CAPRINO'!C13=\"\",\"\",'DATOS RECRIA CAPRINO'!C13)","v":200}]
[]
[null,null,null,null,null,"FECUNDATION",null,"END REARING PERIOD"]
[null,"BODY WEIGHT",{"$f":"IF('DATOS RECRIA CAPRINO'!$P$10=\"\",\"\",'DATOS RECRIA CAPRINO'!P10)","v":3.5},{"$f":"IF('DATOS RECRIA CAPRINO'!P16=\"\",\"\",'DATOS RECRIA CAPRINO'!P16)","v":14},{"$f":"IF('DATOS RECRIA CAPRINO'!P24=\"\",\"\",'DATOS RECRIA CAPRINO'!P24)","v":22},null,{"$f":"IF('DATOS RECRIA CAPRINO'!P33=\"\",\"\",'DATOS RECRIA CAPRINO'!P33)","v":42},{"$f":"IF('DATOS RECRIA CAPRINO'!P41=\"\",\"\",'DATOS RECRIA CAPRINO'!P41)","v":54}]
[null,"DATE",{"$f":"IF('DATOS RECRIA CAPRINO'!S10=\"\",\"\",'DATOS RECRIA CAPRINO'!S10)","v":"2015-11-11"},{"$f":"IF('DATOS RECRIA CAPRINO'!S16=\"\",\"\",'DATOS RECRIA CAPRINO'!S16)","v":"2016-01-08T08:00:00"},{"$f":"IF('DATOS RECRIA CAPRINO'!S24=\"\",\"\",'DATOS RECRIA CAPRINO'!S24)","v":"2016-02-15T19:04:36.923"},{"$f":"IF('DATOS RECRIA CAPRINO'!S32=\"\",\"\",'DATOS RECRIA CAPRINO'!S32)","v":"2016-07-20T13:32:18.462"},{"$f":"IF('DATOS RECRIA CAPRINO'!S33=\"\",\"\",'DATOS RECRIA CAPRINO'!S33)","v":"2016-07-18T15:23:04.615"},{"$f":"IF('DATOS RECRIA CAPRINO'!S41=\"\",\"\",'DATOS RECRIA CAPRINO'!S41)","v":"2016-11-02T13:32:18.462"}]
[null,"PRODUCT",{"$f":"IF('DATOS RECRIA CAPRINO'!U31=\"\",\"\",'DATOS RECRIA CAPRINO'!U31)","v":"NANTAMILK SUPREME"},{"$f":"IF('DATOS RECRIA CAPRINO'!U33=\"\",\"\",'DATOS RECRIA CAPRINO'!U33)","v":"NANTACOR "},{"$f":"IF('DATOS RECRIA CAPRINO'!U34=\"\",\"\",'DATOS RECRIA CAPRINO'!U34)","v":"CAPRIRECRIA"},null,{"$f":"IF('DATOS RECRIA CAPRINO'!U35=\"\",\"\",'DATOS RECRIA CAPRINO'!U35)","v":"CAPRIRECRIA CONT."},{"$f":"IF('DATOS RECRIA OVINO'!V35=\"\",\"\",'DATOS RECRIA OVINO'!V35)","v":""}]
[null,null,{"$f":"IF('DATOS RECRIA CAPRINO'!U32=\"\",\"\",'DATOS RECRIA CAPRINO'!U32)","v":"LACTACOR COPOS"}]
[null,"DAYS",{"$f":"IF('DATOS RECRIA CAPRINO'!R14=\"\",\"\",'DATOS RECRIA CAPRINO'!R14)","v":58.333333333333336},{"$f":"IF('DATOS RECRIA CAPRINO'!R21=\"\",\"\",'DATOS RECRIA CAPRINO'!R21)","v":38.46153846153846},{"$f":"IF('DATOS RECRIA CAPRINO'!R29=\"\",\"\",'DATOS RECRIA CAPRINO'!R29)","v":153.84615384615384},null,{"$f":"IF('DATOS RECRIA CAPRINO'!R37=\"\",\"\",'DATOS RECRIA CAPRINO'!R37)","v":106.92307692307804},{"$f":"IF('DATOS RECRIA OVINO'!S37=\"\",\"\",'DATOS RECRIA OVINO'!S37)","v":""}]
[null,"MONTH",{"$f":"IF('DATOS RECRIA CAPRINO'!R15=\"\",\"\",'DATOS RECRIA CAPRINO'!R15)","v":1.9444444444444444},{"$f":"IF('DATOS RECRIA CAPRINO'!R22=\"\",\"\",'DATOS RECRIA CAPRINO'!R22)","v":1.2820512820512819},{"$f":"IF('DATOS RECRIA CAPRINO'!R30=\"\",\"\",'DATOS RECRIA CAPRINO'!R30)","v":5.1282051282051277},null,{"$f":"IF('DATOS RECRIA CAPRINO'!R38=\"\",\"\",'DATOS RECRIA CAPRINO'!R38)","v":3.5641025641026016},{"$f":"IF('DATOS RECRIA OVINO'!S38=\"\",\"\",'DATOS RECRIA OVINO'!S38)","v":""}]
{"$rows_left_out":4}
{"sheet":"SIMULACION OVINO","index":6,"n_rows":40,"n_cols":5,"rows_kept":40,"cut":false,"hidden":false,"merged":[[18,0,21,0],[22,2,22,3],[23,2,23,3],[8,0,11,0],[10,3,11,3],[13,0,15,0]]}
[]
[]
[]
[]
[]
[]
["REARING SHEEP SIMULATION"]
[]
["INITIAL DATA","PERIOD","GROW UP"]
[null,"INITIAL DATE","2021-05-12"]
[null,"INITIAL BODY WEIGHT",12,{"$f":"IF(C9=\"\",\"\",'HOJA DE DATOS'!E30)","v":"12 a 30"}]
[null,"TARGET BODY WEIGT",28]
[]
["RECOMENDATIONS","PESOS PERIODO",{"$f":"IF(D11=\"\",\"\",D11)","v":"12 a 30"}]
[null,"GMD RECOMENDADA",{"$f":"IF(C9=\"\",\"\",'HOJA DE DATOS'!E31)","v":" > 280 gr/dia"}]
{"$rows_left_out":26}
{"sheet":"SIMULACION CAPRINO","index":7,"n_rows":41,"n_cols":5,"rows_kept":41,"cut":false,"hidden":false,"merged":[[24,2,25,3],[8,0,11,0],[10,3,11,3],[13,0,15,0],[18,0,21,0],[22,2,22,3],[23,2,23,3]]}
[]
[]
[]
[]
[]
[]
["REARING SHEEP SIMULATION"]
[]
["INITIAL DATA","PERIOD"]
[null,"INITIAL DATE"]
[null,"INITIAL BODY WEIGHT",null,{"$f":"IF(C9=\"\",\"\",'HOJA DE DATOS'!E75)","v":""}]
[null,"TARGET BODY WEIGT"]
[]
["RECOMENDATIONS","PESOS PERIODO",{"$f":"IF(D11=\"\",\"\",D11)","v":""}]
[null,"GMD RECOMENDADA",{"$f":"IF(C9=\"\",\"\",'HOJA DE DATOS'!E76)","v":""}]
{"$rows_left_out":27}
{"sheet":"PIENSOS","index":8,"n_rows":34,"n_cols":4,"rows_kept":34,"cut":false,"hidden":false,"merged":[]}
["FEED"]
[]
["PRESTARTER","COD IRIS","NAME","UFV"]
["OVIBABY","1099HGR.",{"$f":"A4","v":"OVIBABY"},1.05]
["LACTACOR COPOS","1439HGR.","LACTACOR COPOS",1.0349999999999999]
["NANTACOR INICIACION","1100GGR.","NANTACOR INICIACION",1.04]
[null,null,{"$f":"IF(A7=\"\",\"\",A7)","v":""}]
[]
[]
["GROW UP","COD IRIS","NAME","UFV"]
["NANTACOR INICIACION","1100GGR.",{"$f":"A11","v":"NANTACOR INICIACION"},1.04]
["NANTACOR ","1101GGR.","NANTACOR ",0.995]
["NANTACOR CEBIAL","1102GGR.",{"$f":"A13","v":"NANTACOR CEBIAL"},0.93]
["NANTACOR C. PESADO","1105GGR.",{"$f":"A14","v":"NANTACOR C. PESADO"},0.97499999999999998]
["NANTACOR C. INTENSIVO","1104GGR.","NANTACOR C. INTENSIVO",0.995]
{"$rows_left_out":20}
{"sheet":"MODULO","index":9,"n_rows":0,"n_cols":0,"rows_kept":0,"cut":false,"hidden":false,"merged":[]}